fix(#369)-feat: infinite loop cause by requestInterception and load file as buffer

3 jobs for master in 43 seconds (queued for 1 second)
latest
Status Name Job ID Coverage
  Test
failed test #111008

00:00:43

failed test #111006

00:01:19

 
  Deploy
skipped pack #111007
 
Name Stage Failure
failed
test Test
npm ERR! Missing script: "test"
npm ERR!
npm ERR! To see a list of scripts, run:
npm ERR! npm run

npm ERR! A complete log of this run can be found in:
npm ERR! /root/.npm/_logs/2022-04-22T21_46_01_111Z-debug-0.log
Cleaning up project directory and file based variables
ERROR: Job failed: exit code 1