chore: update yarn.lock

4 jobs for <span class="ref-name">migrate_to_graphql</span> in 6 minutes and 28 seconds
Status Job ID Name Coverage
  Build
passed #52491
build

00:04:11

 
  Test
failed #52494
lint

00:00:14

failed #52492
test:chrome

00:02:15

failed #52493
test:firefox

00:01:23

 
Name Stage Failure
failed
test:chrome Test
         at TestRun._executeTestFn
(/home/pubsweet/node_modules/testcafe/src/test-run/index.js:235:38)
at _executeTestFn
(/home/pubsweet/node_modules/testcafe/src/test-run/index.js:284:24)



2/2 failed (1m 06s)
ERROR: Job failed: exit code 1
failed
lint Test
npm ERR! @pubsweet/starter@1.0.0-alpha.1 lint: `eslint --ext js,jsx app config test webpack`
npm ERR! Exit status 1
npm ERR!
npm ERR! Failed at the @pubsweet/starter@1.0.0-alpha.1 lint script.
npm ERR! This is probably not a problem with npm. There is likely additional logging output above.

npm ERR! A complete log of this run can be found in:
npm ERR! /home/pubsweet/.npm/_logs/2019-04-09T21_03_17_104Z-debug.log
ERROR: Job failed: exit code 1
failed
test:firefox Test
         at TestRun._executeTestFn
(/home/pubsweet/node_modules/testcafe/src/test-run/index.js:235:38)
at _executeTestFn
(/home/pubsweet/node_modules/testcafe/src/test-run/index.js:284:24)



2/2 failed (52s)
ERROR: Job failed: exit code 1