refactor(client): ws default values removed

8 jobs for configurable-websocket in 88 minutes and 21 seconds (queued for 2 seconds)
Status Name Job ID Coverage
  Build
passed build #94286

00:04:35

 
  Test
passed lint:commits #94290

00:00:18

passed lint:js #94288

00:23:42

passed lint:json #94289

00:00:18

failed lint:style #94287

00:23:20

failed test #94291

01:00:01

60.72%
 
  Review
skipped pages:review #94292
 
  Audit
skipped audit #94293
allowed to fail
 
Name Stage Failure
failed
test Test The script exceeded the maximum execution time set for the job
(node:33) UnhandledPromiseRejectionWarning: Unhandled promise rejection. This error originated either by throwing inside of an async function without a catch block, or by rejecting a promise which was not handled with .catch(). To terminate the node process on unhandled promise rejection, use the CLI flag `--unhandled-rejections=strict` (see https://nodejs.org/api/cli.html#cli_unhandled_rejections_mode). (rejection id: 135)
(node:33) UnhandledPromiseRejectionWarning: error: database "test_2286311" does not exist
(node:33) UnhandledPromiseRejectionWarning: Unhandled promise rejection. This error originated either by throwing inside of an async function without a catch block, or by rejecting a promise which was not handled with .catch(). To terminate the node process on unhandled promise rejection, use the CLI flag `--unhandled-rejections=strict` (see https://nodejs.org/api/cli.html#cli_unhandled_rejections_mode). (rejection id: 140)
(node:33) UnhandledPromiseRejectionWarning: error: database "test_2286311" does not exist
(node:33) UnhandledPromiseRejectionWarning: Unhandled promise rejection. This error originated either by throwing inside of an async function without a catch block, or by rejecting a promise which was not handled with .catch(). To terminate the node process on unhandled promise rejection, use the CLI flag `--unhandled-rejections=strict` (see https://nodejs.org/api/cli.html#cli_unhandled_rejections_mode). (rejection id: 145)
(node:33) UnhandledPromiseRejectionWarning: error: database "test_2286311" does not exist
(node:33) UnhandledPromiseRejectionWarning: Unhandled promise rejection. This error originated either by throwing inside of an async function without a catch block, or by rejecting a promise which was not handled with .catch(). To terminate the node process on unhandled promise rejection, use the CLI flag `--unhandled-rejections=strict` (see https://nodejs.org/api/cli.html#cli_unhandled_rejections_mode). (rejection id: 150)
Pulling docker image gitlab/gitlab-runner-helper:x86_64-05161b14 ...
ERROR: Job failed: execution took longer than 1h0m0s seconds
failed
lint:style Test There has been a runner system failure, please try again
  on Coko's shared runner VoaxXxkT
Using Docker executor with image pubsweet/pubsweet:2a5943830b311e52b64a381b5719a8bd3c9570a5 ...
Pulling docker image gitlab/gitlab-runner-helper:x86_64-a987417a ...
Using docker image sha256:2ecc4cc715e33d4c56dab2915d9ce5729e81ebad789a971a01ef113b52f01aa9 for gitlab/gitlab-runner-helper:x86_64-a987417a ...
Pulling docker image pubsweet/pubsweet:2a5943830b311e52b64a381b5719a8bd3c9570a5 ...
Using docker image sha256:dfb4cdb6f8f9f7a8f7d508583709fa1fba1e9646bb10f284298f00167cb92e84 for pubsweet/pubsweet:2a5943830b311e52b64a381b5719a8bd3c9570a5 ...
Pulling docker image gitlab/gitlab-runner-helper:x86_64-a987417a ...
Using docker image sha256:2ecc4cc715e33d4c56dab2915d9ce5729e81ebad789a971a01ef113b52f01aa9 for gitlab/gitlab-runner-helper:x86_64-a987417a ...
ERROR: Job failed (system failure): Error response from daemon: No such container: 5c2a8a6f6a241a291549133306222e27c2aa0c2eb19366b151ce83c1e3185f7c (executor_docker.go:743:0s)