feat: fix linting errors

6 jobs for editor-decision-test-accept-reject-review in 5 minutes and 33 seconds (queued for 2 seconds)
latest
Status Name Job ID Coverage
  Build
passed build #32869

00:00:43

 
  Test
passed lint #32870

00:00:30

passed test #32871

00:00:39

failed test:chrome #32872

00:02:18

failed test:firefox #32873

00:03:37

 
  Demo
skipped demo:xpub-collabra #32874
allowed to fail manual
 
Name Stage Failure
failed
test:chrome Test There is an unknown failure, please try again
npm ERR! xpub-collabra@0.0.1 test:e2e:ci:chrome: `ALLOW_CONFIG_MUTATIONS=true NODE_ENV=test testcafe --skip-js-errors 'chrome:headless --no-sandbox' 'test/**/*.test.js'`
npm ERR! Exit status 9
npm ERR!
npm ERR! Failed at the xpub-collabra@0.0.1 test:e2e:ci:chrome script.
npm ERR! This is probably not a problem with npm. There is likely additional logging output above.

npm ERR! A complete log of this run can be found in:
npm ERR! /home/xpub/.npm/_logs/2018-07-01T11_22_09_085Z-debug.log
ERROR: Job failed: exit code 1
failed
test:firefox Test There is an unknown failure, please try again
npm ERR! xpub-collabra@0.0.1 test:e2e:ci:firefox: `ALLOW_CONFIG_MUTATIONS=true NODE_ENV=test testcafe --skip-js-errors firefox:headless 'test/**/*.test.js'`
npm ERR! Exit status 9
npm ERR!
npm ERR! Failed at the xpub-collabra@0.0.1 test:e2e:ci:firefox script.
npm ERR! This is probably not a problem with npm. There is likely additional logging output above.

npm ERR! A complete log of this run can be found in:
npm ERR! /home/xpub/.npm/_logs/2018-07-01T11_24_40_159Z-debug.log
ERROR: Job failed: exit code 1