Merge branch 'accept-reject-review-e2e-test' into submit-review-e2e-test

6 jobs for submit-review-e2e-test in 7 minutes and 54 seconds (queued for 20 seconds)
latest
Status Name Job ID Coverage
  Build
passed build #34139

00:01:17

 
  Test
passed lint #34140

00:00:23

passed test #34141

00:00:42

failed test:chrome #34142

00:02:40

failed test:firefox #34143

00:02:49

 
  Demo
skipped demo:xpub-collabra #34144
allowed to fail manual
 
Name Stage Failure
failed
test:chrome Test There is an unknown failure, please try again
npm ERR! xpub-collabra@0.0.1 test:e2e:ci:chrome: `ALLOW_CONFIG_MUTATIONS=true NODE_ENV=test testcafe 'chrome:headless --no-sandbox' 'test/**/*.test.js'`
npm ERR! Exit status 3
npm ERR!
npm ERR! Failed at the xpub-collabra@0.0.1 test:e2e:ci:chrome script.
npm ERR! This is probably not a problem with npm. There is likely additional logging output above.

npm ERR! A complete log of this run can be found in:
npm ERR! /home/xpub/.npm/_logs/2018-07-13T12_02_25_934Z-debug.log
ERROR: Job failed: exit code 1
failed
test:firefox Test There is an unknown failure, please try again
npm ERR! xpub-collabra@0.0.1 test:e2e:ci:firefox: `ALLOW_CONFIG_MUTATIONS=true NODE_ENV=test testcafe firefox:headless 'test/**/*.test.js'`
npm ERR! Exit status 3
npm ERR!
npm ERR! Failed at the xpub-collabra@0.0.1 test:e2e:ci:firefox script.
npm ERR! This is probably not a problem with npm. There is likely additional logging output above.

npm ERR! A complete log of this run can be found in:
npm ERR! /home/xpub/.npm/_logs/2018-07-13T12_05_15_877Z-debug.log
ERROR: Job failed: exit code 1